# Fold Change cut-off: 2.0,Unnamed: 1,Unnamed: 2,Unnamed: 3,Unnamed: 4,Unnamed: 5,Unnamed: 6,Unnamed: 7,Unnamed: 8,Unnamed: 9,Unnamed: 10,Unnamed: 11,Unnamed: 12,Unnamed: 13,Unnamed: 14,Unnamed: 15,Unnamed: 16,Unnamed: 17,Unnamed: 18,Unnamed: 19,Unnamed: 20,Unnamed: 21,Unnamed: 22,Unnamed: 23,Unnamed: 24,Unnamed: 25,Unnamed: 26,Unnamed: 27,Unnamed: 28,Unnamed: 29,Unnamed: 30,Unnamed: 31,Unnamed: 32,Unnamed: 33,Unnamed: 34,Unnamed: 35,Unnamed: 36,Unnamed: 37,Unnamed: 38,Unnamed: 39,Unnamed: 40,Unnamed: 41,Unnamed: 42,Unnamed: 43,Unnamed: 44,Unnamed: 45,Unnamed: 46,Unnamed: 47,Unnamed: 48,Unnamed: 49,Unnamed: 50,Unnamed: 51,Unnamed: 52,Unnamed: 53,Unnamed: 54,Unnamed: 55,Unnamed: 56,Unnamed: 57,Unnamed: 58,Unnamed: 59,Unnamed: 60,Unnamed: 61,Unnamed: 62,Unnamed: 63,Unnamed: 64
# P-value cut-off: 0.05,,,,,,,,,,,,,,,,,,,,,,,,,,,,,,,,,,,,,,,,,,,,,,,,,,,,,,,,,,,,,,,,
# Condition pairs: C_vs_Normal,,,,,,,,,,,,,,,,,,,,,,,,,,,,,,,,,,,,,,,,,,,,,,,,,,,,,,,,,,,,,,,,
# Column A: ProbeName it represents probe name.,,,,,,,,,,,,,,,,,,,,,,,,,,,,,,,,,,,,,,,,,,,,,,,,,,,,,,,,,,,,,,,,
"# Column B: P-value, P-value calculated from unpaired t-test.",,,,,,,,,,,,,,,,,,,,,,,,,,,,,,,,,,,,,,,,,,,,,,,,,,,,,,,,,,,,,,,,
"# Column C: FDR, FDR is calculated from Benjamini Hochberg FDR.",,,,,,,,,,,,,,,,,,,,,,,,,,,,,,,,,,,,,,,,,,,,,,,,,,,,,,,,,,,,,,,,
"# Column D: Fold Change, the absolute ratio (no log scale) of normalized intensities between two conditions.",,,,,,,,,,,,,,,,,,,,,,,,,,,,,,,,,,,,,,,,,,,,,,,,,,,,,,,,,,,,,,,,
"# Column E: Regulation, it depicts which group has greater or lower intensity values wrt other group.",,,,,,,,,,,,,,,,,,,,,,,,,,,,,,,,,,,,,,,,,,,,,,,,,,,,,,,,,,,,,,,,
"# Column F ~ AO: Annotations, include Transcript_ID, GeneID, GeneSymbol, type, LncRNA_Completeness, DHS_type, geneCategory, lncRNA_level, Validated, Canonical, Locus, chrom, strand, txStart, txEnd, CancerName, DiseaseName, associated_cell_or_tissue, Subcellular_Localization, source, description, RNAlength, Sequence, TIR_conservation, exon_conservation, TraitName, eQTL_cis_correlated_mRNA_geneID, smProtein, refseqID, relationship, Associated_gene_acc, Associated_gene_name, Associated_protein_name, Associated_gene_strand, associated_gene_start and Associated_gene_end.",,,,,,,,,,,,,,,,,,,,,,,,,,,,,,,,,,,,,,,,,,,,,,,,,,,,,,,,,,,,,,,,
"# Column AP, AQ: Raw Intensity of each group (averaged raw intensities of replicate samples).",,,,,,,,,,,,,,,,,,,,,,,,,,,,,,,,,,,,,,,,,,,,,,,,,,,,,,,,,,,,,,,,
"# Column AR, AS: Normalized Intensity of each group (averaged normalized intensities of replicate samples, log2 transformed).",,,,,,,,,,,,,,,,,,,,,,,,,,,,,,,,,,,,,,,,,,,,,,,,,,,,,,,,,,,,,,,,
# Column AT ~ BC: Raw Intensity of each sample.,,,,,,,,,,,,,,,,,,,,,,,,,,,,,,,,,,,,,,,,,,,,,,,,,,,,,,,,,,,,,,,,
# Column BD ~ BM: Normalized Intensity of each sample (log2 transformed).,,,,,,,,,,,,,,,,,,,,,,,,,,,,,,,,,,,,,,,,,,,,,,,,,,,,,,,,,,,,,,,,
,,,,,,,,,,,,,,,,,,,,,,,,,,,,,,,,,,,,,,,,,,,,,,,,,,,,,,,,,,,,,,,,
Note: ,,,,,,,,,,,,,,,,,,,,,,,,,,,,,,,,,,,,,,,,,,,,,,,,,,,,,,,,,,,,,,,,
"# Column Y: source, the source of LncRNA is collected from.",,,,,,,,,,,,,,,,,,,,,,,,,,,,,,,,,,,,,,,,,,,,,,,,,,,,,,,,,,,,,,,,
RefSeq: transcripts collected from RefSeq database;,,,,,,,,,,,,,,,,,,,,,,,,,,,,,,,,,,,,,,,,,,,,,,,,,,,,,,,,,,,,,,,,
"UCSC_knowngene: UCSC known genes annotated as ""non-coding"", ""near-coding"" and ""antisense"" (http://genome.ucsc.edu/cgi-bin/hgTables/);",,,,,,,,,,,,,,,,,,,,,,,,,,,,,,,,,,,,,,,,,,,,,,,,,,,,,,,,,,,,,,,,
GENCODE: the GENCODE project (http://www.gencodegenes.org/);,,,,,,,,,,,,,,,,,,,,,,,,,,,,,,,,,,,,,,,,,,,,,,,,,,,,,,,,,,,,,,,,
lncRNAdb: http://lncrna.com;,,,,,,,,,,,,,,,,,,,,,,,,,,,,,,,,,,,,,,,,,,,,,,,,,,,,,,,,,,,,,,,,
lncRNAdisease database: http://210.73.221.6/lncrnadisease;,,,,,,,,,,,,,,,,,,,,,,,,,,,,,,,,,,,,,,,,,,,,,,,,,,,,,,,,,,,,,,,,
RNAdb: RNAdb2.0 (http://research.imb.uq.edu.au/rnadb/);,,,,,,,,,,,,,,,,,,,,,,,,,,,,,,,,,,,,,,,,,,,,,,,,,,,,,,,,,,,,,,,,
NRED: NRED (http://jsm-research.imb.uq.edu.au/nred/cgi-bin/ncrnadb.pl);,,,,,,,,,,,,,,,,,,,,,,,,,,,,,,,,,,,,,,,,,,,,,,,,,,,,,,,,,,,,,,,,
"UCR: ""ultra-conserved region"" among human, mouse and rat (http://users.soe.ucsc.edu/~jill/ultra.html);",,,,,,,,,,,,,,,,,,,,,,,,,,,,,,,,,,,,,,,,,,,,,,,,,,,,,,,,,,,,,,,,
"RNA-seq: Cabili et al 2011, RNA-seq: Clark et al 2015, RNA-seq: Iyer et al 2015: lincRNAs identified by RNA-seq from 3 literatures seperately.",,,,,,,,,,,,,,,,,,,,,,,,,,,,,,,,,,,,,,,,,,,,,,,,,,,,,,,,,,,,,,,,
Literatures: XXX: The PubMed ID is listed of which support the research of corresponding LncRNA.,,,,,,,,,,,,,,,,,,,,,,,,,,,,,,,,,,,,,,,,,,,,,,,,,,,,,,,,,,,,,,,,
CAFE: CAFÉ – assembling high-confidence coding and noncoding transcriptome maps.,,,,,,,,,,,,,,,,,,,,,,,,,,,,,,,,,,,,,,,,,,,,,,,,,,,,,,,,,,,,,,,,
CLSFL: https://public-docs.crg.es/rguigo/CLS/,,,,,,,,,,,,,,,,,,,,,,,,,,,,,,,,,,,,,,,,,,,,,,,,,,,,,,,,,,,,,,,,
FANTOM5CAT:http://fantom.gsc.riken.jp/cat/,,,,,,,,,,,,,,,,,,,,,,,,,,,,,,,,,,,,,,,,,,,,,,,,,,,,,,,,,,,,,,,,
LncBook: https://bigd.big.ac.cn/lncbook/index,,,,,,,,,,,,,,,,,,,,,,,,,,,,,,,,,,,,,,,,,,,,,,,,,,,,,,,,,,,,,,,,
,,,,,,,,,,,,,,,,,,,,,,,,,,,,,,,,,,,,,,,,,,,,,,,,,,,,,,,,,,,,,,,,
"# Columns AI ~ AO: the relationship of LncRNA and its nearby coding gene and the coordinate of the coding gene, including relationship, Associated_gene_acc, Associated_gene_name, Associated_protein_name, Associated_gene_strand, Associated_gene_start and Associated_gene_end.",,,,,,,,,,,,,,,,,,,,,,,,,,,,,,,,,,,,,,,,,,,,,,,,,,,,,,,,,,,,,,,,
"""exon sense-overlapping"": the LncRNA's exon is overlapping a coding transcript exon on the same genomic strand;",,,,,,,,,,,,,,,,,,,,,,,,,,,,,,,,,,,,,,,,,,,,,,,,,,,,,,,,,,,,,,,,
"""intronic"": the LncRNA is overlapping the intron of a coding transcript on the same genomic strand;",,,,,,,,,,,,,,,,,,,,,,,,,,,,,,,,,,,,,,,,,,,,,,,,,,,,,,,,,,,,,,,,
"""natural antisense"": the LncRNA is transcribed from the antisense strand and overlapping with a coding transcript;",,,,,,,,,,,,,,,,,,,,,,,,,,,,,,,,,,,,,,,,,,,,,,,,,,,,,,,,,,,,,,,,
"""non-overlapping antisense"": the LncRNA is transcribed from the antisense strand without sharing overlapping exons;",,,,,,,,,,,,,,,,,,,,,,,,,,,,,,,,,,,,,,,,,,,,,,,,,,,,,,,,,,,,,,,,
"""bidirectional"": the LncRNA is oriented head to head to a coding transcript within 1000 bp;",,,,,,,,,,,,,,,,,,,,,,,,,,,,,,,,,,,,,,,,,,,,,,,,,,,,,,,,,,,,,,,,
"""intergenic"": there are no overlapping or bidirectional coding transcripts nearby the LncRNA.",,,,,,,,,,,,,,,,,,,,,,,,,,,,,,,,,,,,,,,,,,,,,,,,,,,,,,,,,,,,,,,,
,,,,,,,,,,,,,,,,,,,,,,,,,,,,,,,,,,,,,,,,,,,,,,,,,,,,,,,,,,,,,,,,
Important annotations:,,,,,,,,,,,,,,,,,,,,,,,,,,,,,,,,,,,,,,,,,,,,,,,,,,,,,,,,,,,,,,,,
Transcript_ID: lncRNA transcript's id.,,,,,,,,,,,,,,,,,,,,,,,,,,,,,,,,,,,,,,,,,,,,,,,,,,,,,,,,,,,,,,,,
GeneID: lncRNA gene's id.,,,,,,,,,,,,,,,,,,,,,,,,,,,,,,,,,,,,,,,,,,,,,,,,,,,,,,,,,,,,,,,,
GeneSymbol: lncRNA gene's symbol.,,,,,,,,,,,,,,,,,,,,,,,,,,,,,,,,,,,,,,,,,,,,,,,,,,,,,,,,,,,,,,,,
type: The probe's target transcript type (lncRNA).,,,,,,,,,,,,,,,,,,,,,,,,,,,,,,,,,,,,,,,,,,,,,,,,,,,,,,,,,,,,,,,,
LncRNA_Completeness: If lncRNA transcript is complete transcript.,,,,,,,,,,,,,,,,,,,,,,,,,,,,,,,,,,,,,,,,,,,,,,,,,,,,,,,,,,,,,,,,
"DHS_type: Definition of genes originating from promoter, enhancer and dyadic regulatory regions.",,,,,,,,,,,,,,,,,,,,,,,,,,,,,,,,,,,,,,,,,,,,,,,,,,,,,,,,,,,,,,,,
        The definition of DNaseI-accessible regulatory regions is based on the Roadmap Epigenome Consortium23 (http://egg2.wustl.edu/roadmap/web_portal/DNase_reg.html).,,,,,,,,,,,,,,,,,,,,,,,,,,,,,,,,,,,,,,,,,,,,,,,,,,,,,,,,,,,,,,,,
"        A gene is defined as originating from promoter, enhancer or dyadic DHS when its strongest TSS is located within the corresponding type of DHS.",,,,,,,,,,,,,,,,,,,,,,,,,,,,,,,,,,,,,,,,,,,,,,,,,,,,,,,,,,,,,,,,
geneCategory: LncRNA category of transcript.,,,,,,,,,,,,,,,,,,,,,,,,,,,,,,,,,,,,,,,,,,,,,,,,,,,,,,,,,,,,,,,,
"lncRNA_level: Arraystar's classification of lncRNAs,if a lncRNA's transcript_support_level=1 in GENCODE database or marked ""full length"" in Refseq database,then it will be given ""Gold"" tag.",,,,,,,,,,,,,,,,,,,,,,,,,,,,,,,,,,,,,,,,,,,,,,,,,,,,,,,,,,,,,,,,
Validated: If a lncRNA was validated in lncRNADb or LncBook database.,,,,,,,,,,,,,,,,,,,,,,,,,,,,,,,,,,,,,,,,,,,,,,,,,,,,,,,,,,,,,,,,
Canonical: If a lncRNA is the canonical transcript in gene locus.,,,,,,,,,,,,,,,,,,,,,,,,,,,,,,,,,,,,,,,,,,,,,,,,,,,,,,,,,,,,,,,,
Locus: LncRNA transcript's genomic locus(HG19).,,,,,,,,,,,,,,,,,,,,,,,,,,,,,,,,,,,,,,,,,,,,,,,,,,,,,,,,,,,,,,,,
CancerName: The name of the cancer.,,,,,,,,,,,,,,,,,,,,,,,,,,,,,,,,,,,,,,,,,,,,,,,,,,,,,,,,,,,,,,,,
"DiseaseName: Gene-disease association data,this column's data come from the database LncRNADisease and DriverDB2.",,,,,,,,,,,,,,,,,,,,,,,,,,,,,,,,,,,,,,,,,,,,,,,,,,,,,,,,,,,,,,,,
"associated_cell_or_tissue: Gene assocaited cell or tissue types, this column's data come from the FANTOM5 CAT annotation.",,,,,,,,,,,,,,,,,,,,,,,,,,,,,,,,,,,,,,,,,,,,,,,,,,,,,,,,,,,,,,,,
"        For example,ENST00000430027(DLX6-AS1) associated cell or tissue:",,,,,,,,,,,,,,,,,,,,,,,,,,,,,,,,,,,,,,,,,,,,,,,,,,,,,,,,,,,,,,,,
"        ""19"" means the DLX6-AS1 gene has associated 19 types of cell or tissue;",,,,,,,,,,,,,,,,,,,,,,,,,,,,,,,,,,,,,,,,,,,,,,,,,,,,,,,,,,,,,,,,
"        ""nervous_system[196.11]"" means the DLX-6 gene has correlation score 196.11 with the nervous_system;higher score  means higher tissuespecificity;",,,,,,,,,,,,,,,,,,,,,,,,,,,,,,,,,,,,,,,,,,,,,,,,,,,,,,,,,,,,,,,,
Subcellular_Localization: Transcript's subcellular localization.,,,,,,,,,,,,,,,,,,,,,,,,,,,,,,,,,,,,,,,,,,,,,,,,,,,,,,,,,,,,,,,,
source: The transcript's source database.,,,,,,,,,,,,,,,,,,,,,,,,,,,,,,,,,,,,,,,,,,,,,,,,,,,,,,,,,,,,,,,,
description: Description of transcript.,,,,,,,,,,,,,,,,,,,,,,,,,,,,,,,,,,,,,,,,,,,,,,,,,,,,,,,,,,,,,,,,
RNAlength: The length of the transcript.,,,,,,,,,,,,,,,,,,,,,,,,,,,,,,,,,,,,,,,,,,,,,,,,,,,,,,,,,,,,,,,,
Sequence: Sequence of the probe.,,,,,,,,,,,,,,,,,,,,,,,,,,,,,,,,,,,,,,,,,,,,,,,,,,,,,,,,,,,,,,,,
"TIR_conservation: If TIR (transcription initiation regions) conserved, only transcripts source from FANTOM5 CAT database have this annotation.",,,,,,,,,,,,,,,,,,,,,,,,,,,,,,,,,,,,,,,,,,,,,,,,,,,,,,,,,,,,,,,,
"exon_conservation:  If transcript's exon region conserved, only transcripts source from FANTOM5 CAT database have this annotation.",,,,,,,,,,,,,,,,,,,,,,,,,,,,,,,,,,,,,,,,,,,,,,,,,,,,,,,,,,,,,,,,
"TraitName: Associated human GWAS traits by SNP, only transcripts source from FANTOM5 CAT database have this annotation.",,,,,,,,,,,,,,,,,,,,,,,,,,,,,,,,,,,,,,,,,,,,,,,,,,,,,,,,,,,,,,,,
"eQTL_cis_correlated_mRNA_geneID:  Evaluated expression correlation of lncRNA-mRNA pairs linked by eQTL-associated SNPs, eQTL-linked lncRNA-mRNA pairs were generally more co-expressed. only transcripts source from FANTOM5 CAT database have this annotation.",,,,,,,,,,,,,,,,,,,,,,,,,,,,,,,,,,,,,,,,,,,,,,,,,,,,,,,,,,,,,,,,
smProtein: Putative coding potential for small peptides in lncRNAs.High-confidence set.,,,,,,,,,,,,,,,,,,,,,,,,,,,,,,,,,,,,,,,,,,,,,,,,,,,,,,,,,,,,,,,,
refseqID: Refseq ID of transcript.,,,,,,,,,,,,,,,,,,,,,,,,,,,,,,,,,,,,,,,,,,,,,,,,,,,,,,,,,,,,,,,,
,,,,,,,,,,,,,,,,,,,,,,,,,,,,,,,,,,,,,,,,,,,,,,,,,,,,,,,,,,,,,,,,
,,,,,,,,,,,,,,,,,,,,,,,,,,,,,,,,,,,,,,,,,,,,,,,,,,,,,,,,,,,,,,,,
,,,,,,,,,,,,,,,,,,,,,,,,,,,,,,,,,,,,,,,,,,,,,,,,,,,,,,,,,,,,,,,,
C_vs_Normal 2.0 fold up regulated LncRNAs,,,,,,,,,,,,,,,,,,,,,,,,,,,,,,,,,,,,,,,,,,,,,,,,,,,,,,,,,,,,,,,,
,P-value and FDR,,Fold change and Regulation,,Annotations,,,,,,,,,,,,,,,,,,,,,,,,,,,,,,,,,,,,Group--Raw Intensity,,Group--Normalized Intensity,,Raw Intensity,,,,,,,,,,Normalized Intensity,,,,,,,,,
ProbeName,P-value,FDR,Fold Change,Regulation,Transcript_ID,GeneID,GeneSymbol,type,LncRNA_Completeness,DHS_type,geneCategory,lncRNA_level,Validated,Canonical,Locus,chrom,strand,txStart,txEnd,CancerName,DiseaseName,associated_cell_or_tissue,Subcellular_Localization,source,description,RNAlength,Sequence,TIR_conservation,exon_conservation,TraitName,eQTL_cis_correlated_mRNA_geneID,smProtein,refseqID,relationship,Associated_gene_acc,Associated_gene_name,Associated_protein_name,Associated_gene_strand,associated_gene_start,Associated_gene_end,group-C(raw),group-Normal(raw),group-C(normalized),group-Normal(normalized),"[C20, C](raw)","[C45, C](raw)","[C67, C](raw)","[C69, C](raw)","[C92, C](raw)","[N30, Normal](raw)","[N51, Normal](raw)","[N53, Normal](raw)","[N54, Normal](raw)","[N57, Normal](raw)","[C20, C](normalized)","[C45, C](normalized)","[C67, C](normalized)","[C69, C](normalized)","[C92, C](normalized)","[N30, Normal](normalized)","[N51, Normal](normalized)","[N53, Normal](normalized)","[N54, Normal](normalized)","[N57, Normal](normalized)"
ASHG19LNC1A105899803V5,0.0361245080533,0.078281257,3.3702667,up,ENST00000515527,ENSG00000170365,SMAD1,lncRNA,;FANTOM5CAT:Complete5End;,DHS_promoter,,Reliable,,No,chr4:146403650-146435898:+,chr4,+,146403650,146435898,,,,Endoplasmic reticulum;Ribosome,GENCODE,SMAD family member 1 [Source:HGNC Symbol;Acc:HGNC:6767],632,CGTTCCTTTCCCTTTACCGGAGTCGATTGCCTCACTGCATGTGTATTCGTGCTGACTGGG,conserved,conserved,,,,,bidirectional,ENCT00000337405,CATG00000074073.1,,-,146399602,146403994,287.806358,270.299765,8.336909,6.584046,257.39194,156.94342,544.7876,284.71576,195.19307,922.9222,159.7461,41.868034,51.35557,175.60692,8.332703,7.954529,8.94361,8.520145,7.9335575,9.01167,6.5625377,5.2609234,5.4186206,6.666479
ASHG19LNC1A105899803V5,0.0361245080533,0.078281257,3.3702667,up,ENST00000515527,ENSG00000170365,SMAD1,lncRNA,;FANTOM5CAT:Complete5End;,DHS_promoter,,Reliable,,No,chr4:146403650-146435898:+,chr4,+,146403650,146435898,,,,Endoplasmic reticulum;Ribosome,GENCODE,SMAD family member 1 [Source:HGNC Symbol;Acc:HGNC:6767],632,CGTTCCTTTCCCTTTACCGGAGTCGATTGCCTCACTGCATGTGTATTCGTGCTGACTGGG,conserved,conserved,,,,,bidirectional,ENST00000514831,SMAD1,,+,146402850,146436103,287.806358,270.299765,8.336909,6.584046,257.39194,156.94342,544.7876,284.71576,195.19307,922.9222,159.7461,41.868034,51.35557,175.60692,8.332703,7.954529,8.94361,8.520145,7.9335575,9.01167,6.5625377,5.2609234,5.4186206,6.666479
ASHG19LNC1A105899803V5,0.0361245080533,0.078281257,3.3702667,up,ENST00000515527,ENSG00000170365,SMAD1,lncRNA,;FANTOM5CAT:Complete5End;,DHS_promoter,,Reliable,,No,chr4:146403650-146435898:+,chr4,+,146403650,146435898,,,,Endoplasmic reticulum;Ribosome,GENCODE,SMAD family member 1 [Source:HGNC Symbol;Acc:HGNC:6767],632,CGTTCCTTTCCCTTTACCGGAGTCGATTGCCTCACTGCATGTGTATTCGTGCTGACTGGG,conserved,conserved,,,,,bidirectional,ENST00000515385,SMAD1,,+,146403963,146479231,287.806358,270.299765,8.336909,6.584046,257.39194,156.94342,544.7876,284.71576,195.19307,922.9222,159.7461,41.868034,51.35557,175.60692,8.332703,7.954529,8.94361,8.520145,7.9335575,9.01167,6.5625377,5.2609234,5.4186206,6.666479
ASHG19LNC1A105899803V5,0.0361245080533,0.078281257,3.3702667,up,ENST00000515527,ENSG00000170365,SMAD1,lncRNA,;FANTOM5CAT:Complete5End;,DHS_promoter,,Reliable,,No,chr4:146403650-146435898:+,chr4,+,146403650,146435898,,,,Endoplasmic reticulum;Ribosome,GENCODE,SMAD family member 1 [Source:HGNC Symbol;Acc:HGNC:6767],632,CGTTCCTTTCCCTTTACCGGAGTCGATTGCCTCACTGCATGTGTATTCGTGCTGACTGGG,conserved,conserved,,,,,bidirectional,ENST00000514778,SMAD1,,+,146402346,146436084,287.806358,270.299765,8.336909,6.584046,257.39194,156.94342,544.7876,284.71576,195.19307,922.9222,159.7461,41.868034,51.35557,175.60692,8.332703,7.954529,8.94361,8.520145,7.9335575,9.01167,6.5625377,5.2609234,5.4186206,6.666479
ASHG19LNC1A105899803V5,0.0361245080533,0.078281257,3.3702667,up,ENST00000515527,ENSG00000170365,SMAD1,lncRNA,;FANTOM5CAT:Complete5End;,DHS_promoter,,Reliable,,No,chr4:146403650-146435898:+,chr4,+,146403650,146435898,,,,Endoplasmic reticulum;Ribosome,GENCODE,SMAD family member 1 [Source:HGNC Symbol;Acc:HGNC:6767],632,CGTTCCTTTCCCTTTACCGGAGTCGATTGCCTCACTGCATGTGTATTCGTGCTGACTGGG,conserved,conserved,,,,,bidirectional,ENST00000503324,SMAD1,,+,146403638,146435940,287.806358,270.299765,8.336909,6.584046,257.39194,156.94342,544.7876,284.71576,195.19307,922.9222,159.7461,41.868034,51.35557,175.60692,8.332703,7.954529,8.94361,8.520145,7.9335575,9.01167,6.5625377,5.2609234,5.4186206,6.666479
ASHG19LNC1A105899803V5,0.0361245080533,0.078281257,3.3702667,up,ENST00000515527,ENSG00000170365,SMAD1,lncRNA,;FANTOM5CAT:Complete5End;,DHS_promoter,,Reliable,,No,chr4:146403650-146435898:+,chr4,+,146403650,146435898,,,,Endoplasmic reticulum;Ribosome,GENCODE,SMAD family member 1 [Source:HGNC Symbol;Acc:HGNC:6767],632,CGTTCCTTTCCCTTTACCGGAGTCGATTGCCTCACTGCATGTGTATTCGTGCTGACTGGG,conserved,conserved,,,,,bidirectional,ENST00000507594,SMAD1,,+,146402458,146436052,287.806358,270.299765,8.336909,6.584046,257.39194,156.94342,544.7876,284.71576,195.19307,922.9222,159.7461,41.868034,51.35557,175.60692,8.332703,7.954529,8.94361,8.520145,7.9335575,9.01167,6.5625377,5.2609234,5.4186206,6.666479
ASHG19LNC1A105899803V5,0.0361245080533,0.078281257,3.3702667,up,ENST00000515527,ENSG00000170365,SMAD1,lncRNA,;FANTOM5CAT:Complete5End;,DHS_promoter,,Reliable,,No,chr4:146403650-146435898:+,chr4,+,146403650,146435898,,,,Endoplasmic reticulum;Ribosome,GENCODE,SMAD family member 1 [Source:HGNC Symbol;Acc:HGNC:6767],632,CGTTCCTTTCCCTTTACCGGAGTCGATTGCCTCACTGCATGTGTATTCGTGCTGACTGGG,conserved,conserved,,,,,bidirectional,NM_001354812,SMAD1,,+,146402458,146480325,287.806358,270.299765,8.336909,6.584046,257.39194,156.94342,544.7876,284.71576,195.19307,922.9222,159.7461,41.868034,51.35557,175.60692,8.332703,7.954529,8.94361,8.520145,7.9335575,9.01167,6.5625377,5.2609234,5.4186206,6.666479
ASHG19LNC1A105899803V5,0.0361245080533,0.078281257,3.3702667,up,ENST00000515527,ENSG00000170365,SMAD1,lncRNA,;FANTOM5CAT:Complete5End;,DHS_promoter,,Reliable,,No,chr4:146403650-146435898:+,chr4,+,146403650,146435898,,,,Endoplasmic reticulum;Ribosome,GENCODE,SMAD family member 1 [Source:HGNC Symbol;Acc:HGNC:6767],632,CGTTCCTTTCCCTTTACCGGAGTCGATTGCCTCACTGCATGTGTATTCGTGCTGACTGGG,conserved,conserved,,,,,bidirectional,ENST00000394092,SMAD1,,+,146403957,146479106,287.806358,270.299765,8.336909,6.584046,257.39194,156.94342,544.7876,284.71576,195.19307,922.9222,159.7461,41.868034,51.35557,175.60692,8.332703,7.954529,8.94361,8.520145,7.9335575,9.01167,6.5625377,5.2609234,5.4186206,6.666479
ASHG19LNC1A105899803V5,0.0361245080533,0.078281257,3.3702667,up,ENST00000515527,ENSG00000170365,SMAD1,lncRNA,;FANTOM5CAT:Complete5End;,DHS_promoter,,Reliable,,No,chr4:146403650-146435898:+,chr4,+,146403650,146435898,,,,Endoplasmic reticulum;Ribosome,GENCODE,SMAD family member 1 [Source:HGNC Symbol;Acc:HGNC:6767],632,CGTTCCTTTCCCTTTACCGGAGTCGATTGCCTCACTGCATGTGTATTCGTGCTGACTGGG,conserved,conserved,,,,,bidirectional,ENST00000507367,SMAD1,,+,146403944,146435795,287.806358,270.299765,8.336909,6.584046,257.39194,156.94342,544.7876,284.71576,195.19307,922.9222,159.7461,41.868034,51.35557,175.60692,8.332703,7.954529,8.94361,8.520145,7.9335575,9.01167,6.5625377,5.2609234,5.4186206,6.666479
ASHG19LNC1A105899803V5,0.0361245080533,0.078281257,3.3702667,up,ENST00000515527,ENSG00000170365,SMAD1,lncRNA,;FANTOM5CAT:Complete5End;,DHS_promoter,,Reliable,,No,chr4:146403650-146435898:+,chr4,+,146403650,146435898,,,,Endoplasmic reticulum;Ribosome,GENCODE,SMAD family member 1 [Source:HGNC Symbol;Acc:HGNC:6767],632,CGTTCCTTTCCCTTTACCGGAGTCGATTGCCTCACTGCATGTGTATTCGTGCTGACTGGG,conserved,conserved,,,,,bidirectional,NM_001354813,SMAD1,,+,146402802,146480325,287.806358,270.299765,8.336909,6.584046,257.39194,156.94342,544.7876,284.71576,195.19307,922.9222,159.7461,41.868034,51.35557,175.60692,8.332703,7.954529,8.94361,8.520145,7.9335575,9.01167,6.5625377,5.2609234,5.4186206,6.666479
ASHG19LNC1A105899803V5,0.0361245080533,0.078281257,3.3702667,up,ENST00000515527,ENSG00000170365,SMAD1,lncRNA,;FANTOM5CAT:Complete5End;,DHS_promoter,,Reliable,,No,chr4:146403650-146435898:+,chr4,+,146403650,146435898,,,,Endoplasmic reticulum;Ribosome,GENCODE,SMAD family member 1 [Source:HGNC Symbol;Acc:HGNC:6767],632,CGTTCCTTTCCCTTTACCGGAGTCGATTGCCTCACTGCATGTGTATTCGTGCTGACTGGG,conserved,conserved,,,,,bidirectional,NM_001354814,SMAD1,,+,146402802,146480325,287.806358,270.299765,8.336909,6.584046,257.39194,156.94342,544.7876,284.71576,195.19307,922.9222,159.7461,41.868034,51.35557,175.60692,8.332703,7.954529,8.94361,8.520145,7.9335575,9.01167,6.5625377,5.2609234,5.4186206,6.666479
ASHG19LNC1A105899803V5,0.0361245080533,0.078281257,3.3702667,up,ENST00000515527,ENSG00000170365,SMAD1,lncRNA,;FANTOM5CAT:Complete5End;,DHS_promoter,,Reliable,,No,chr4:146403650-146435898:+,chr4,+,146403650,146435898,,,,Endoplasmic reticulum;Ribosome,GENCODE,SMAD family member 1 [Source:HGNC Symbol;Acc:HGNC:6767],632,CGTTCCTTTCCCTTTACCGGAGTCGATTGCCTCACTGCATGTGTATTCGTGCTGACTGGG,conserved,conserved,,,,,bidirectional,NM_001354816,SMAD1,,+,146403486,146480325,287.806358,270.299765,8.336909,6.584046,257.39194,156.94342,544.7876,284.71576,195.19307,922.9222,159.7461,41.868034,51.35557,175.60692,8.332703,7.954529,8.94361,8.520145,7.9335575,9.01167,6.5625377,5.2609234,5.4186206,6.666479
ASHG19LNC1A105899803V5,0.0361245080533,0.078281257,3.3702667,up,ENST00000515527,ENSG00000170365,SMAD1,lncRNA,;FANTOM5CAT:Complete5End;,DHS_promoter,,Reliable,,No,chr4:146403650-146435898:+,chr4,+,146403650,146435898,,,,Endoplasmic reticulum;Ribosome,GENCODE,SMAD family member 1 [Source:HGNC Symbol;Acc:HGNC:6767],632,CGTTCCTTTCCCTTTACCGGAGTCGATTGCCTCACTGCATGTGTATTCGTGCTGACTGGG,conserved,conserved,,,,,bidirectional,NM_001354811,SMAD1,,+,146403486,146480325,287.806358,270.299765,8.336909,6.584046,257.39194,156.94342,544.7876,284.71576,195.19307,922.9222,159.7461,41.868034,51.35557,175.60692,8.332703,7.954529,8.94361,8.520145,7.9335575,9.01167,6.5625377,5.2609234,5.4186206,6.666479
ASHG19LNC1A105899803V5,0.0361245080533,0.078281257,3.3702667,up,ENST00000515527,ENSG00000170365,SMAD1,lncRNA,;FANTOM5CAT:Complete5End;,DHS_promoter,,Reliable,,No,chr4:146403650-146435898:+,chr4,+,146403650,146435898,,,,Endoplasmic reticulum;Ribosome,GENCODE,SMAD family member 1 [Source:HGNC Symbol;Acc:HGNC:6767],632,CGTTCCTTTCCCTTTACCGGAGTCGATTGCCTCACTGCATGTGTATTCGTGCTGACTGGG,conserved,conserved,,,,,bidirectional,ENST00000512019,SMAD1,,+,146403023,146436165,287.806358,270.299765,8.336909,6.584046,257.39194,156.94342,544.7876,284.71576,195.19307,922.9222,159.7461,41.868034,51.35557,175.60692,8.332703,7.954529,8.94361,8.520145,7.9335575,9.01167,6.5625377,5.2609234,5.4186206,6.666479
ASHG19LNC1A105899803V5,0.0361245080533,0.078281257,3.3702667,up,ENST00000515527,ENSG00000170365,SMAD1,lncRNA,;FANTOM5CAT:Complete5End;,DHS_promoter,,Reliable,,No,chr4:146403650-146435898:+,chr4,+,146403650,146435898,,,,Endoplasmic reticulum;Ribosome,GENCODE,SMAD family member 1 [Source:HGNC Symbol;Acc:HGNC:6767],632,CGTTCCTTTCCCTTTACCGGAGTCGATTGCCTCACTGCATGTGTATTCGTGCTGACTGGG,conserved,conserved,,,,,bidirectional,ENST00000302085,SMAD1,,+,146402944,146479231,287.806358,270.299765,8.336909,6.584046,257.39194,156.94342,544.7876,284.71576,195.19307,922.9222,159.7461,41.868034,51.35557,175.60692,8.332703,7.954529,8.94361,8.520145,7.9335575,9.01167,6.5625377,5.2609234,5.4186206,6.666479
ASHG19LNC1A105899803V5,0.0361245080533,0.078281257,3.3702667,up,ENST00000515527,ENSG00000170365,SMAD1,lncRNA,;FANTOM5CAT:Complete5End;,DHS_promoter,,Reliable,,No,chr4:146403650-146435898:+,chr4,+,146403650,146435898,,,,Endoplasmic reticulum;Ribosome,GENCODE,SMAD family member 1 [Source:HGNC Symbol;Acc:HGNC:6767],632,CGTTCCTTTCCCTTTACCGGAGTCGATTGCCTCACTGCATGTGTATTCGTGCTGACTGGG,conserved,conserved,,,,,bidirectional,uc011cic.2,SMAD1,,+,146435590,146480325,287.806358,270.299765,8.336909,6.584046,257.39194,156.94342,544.7876,284.71576,195.19307,922.9222,159.7461,41.868034,51.35557,175.60692,8.332703,7.954529,8.94361,8.520145,7.9335575,9.01167,6.5625377,5.2609234,5.4186206,6.666479